Reaction Details
TargetApoptosis regulator Bcl-2
LigandBDBM50078166
Substrate/Competitorn/a
Meas. Tech.ChEMBL_1472608 (CHEMBL3417973)
Ki>10000±n/a nM
Citation Bruncko, MWang, LSheppard, GSPhillips, DCTahir, SKXue, JErickson, SFidanze, SFry, EHasvold, LJenkins, GJJin, SJudge, RAKovar, PJMadar, DNimmer, PPark, CPetros, AMRosenberg, SHSmith, MLSong, XSun, CTao, ZFWang, XXiao, YZhang, HTse, CLeverson, JDElmore, SWSouers, AJ Structure-guided design of a series of MCL-1 inhibitors with high affinity and selectivity. J Med Chem58:2180-94 (2015) 
 
Apoptosis regulator Bcl-2
Name:Apoptosis regulator Bcl-2
Type:Homodimer or heterodimer
Mol. Mass.:26269.11
Organism:Homo sapiens (Human)
Description:P10415
Residue:239
BDBM50078166
NameBDBM50078166
Synonyms:CHEMBL3417580
TypeSmall organic molecule
Emp. Form.C19H25NO2
Mol. Mass.299.4073
SMILESOC(=O)c1[nH]c2ccccc2c1CCCCC1CCCCC1