Reaction Details
Target3-phosphoinositide-dependent protein kinase 1
LigandBDBM50078207
Substrate/Competitorn/a
Meas. Tech.ChEMBL_1470575 (CHEMBL3419801)
Kd 11100±n/a nM
Citation Yan, RChuang, HCKapuriya, NChou, CCLai, PTChang, HWYang, CNKulp, SKChen, CS Exploitation of the ability of¿-tocopherol to facilitate membrane co-localization of Akt and PHLPP1 to develop PHLPP1-targeted Akt inhibitors. J Med Chem58:2290-8 (2015) 
 
3-phosphoinositide-dependent protein kinase 1
Name:3-phosphoinositide-dependent protein kinase 1
Type:Enzyme
Mol. Mass.:63157.65
Organism:Homo sapiens (Human)
Description:O15530
Residue:556
BDBM50078207
NameBDBM50078207
Synonyms:CHEMBL3414688
TypeSmall organic molecule
Emp. Form.C16H24BrNO3S
Mol. Mass.390.336
SMILESCC(C)CCCC1(C)CCc2cc(cc(Br)c2O1)S(N)(=O)=O