Reaction Details
TargetBeta-secretase 1
LigandBDBM142394
Substrate/Competitorn/a
Meas. Tech.ChEMBL_1470595 (CHEMBL3420008)
IC50 1070±n/a nM
Citation Butler, CRBrodney, MABeck, EMBarreiro, GNolan, CEPan, FVajdos, FParris, KVarghese, AHHelal, CJLira, RDoran, SDRiddell, DRBuzon, LMDutra, JKMartinez-Alsina, LAOgilvie, KMurray, JCYoung, JMAtchison, KRobshaw, AGonzales, CWang, JZhang, YO'Neill, BT Discovery of a series of efficient, centrally efficacious BACE1 inhibitors through structure-based drug design. J Med Chem58:2678-702 (2015) 
 
Beta-secretase 1
Name:Beta-secretase 1
Type:Protein
Mol. Mass.:55755.10
Organism:Homo sapiens (Human)
Description:P56817
Residue:501
BDBM142394
NameBDBM142394
Synonyms:US8933221, 4
TypeSmall organic molecule
Emp. Form.C14H15F3N2OS
Mol. Mass.316.342
SMILESNC1=N[C@]2(CO[C@@H](CF)C[C@H]2CS1)c1ccc(F)cc1F