Reaction Details
TargetBeta-secretase 1
LigandBDBM50078352
Substrate/Competitorn/a
Meas. Tech.ChEMBL_1470724 (CHEMBL3420730)
IC50 375±n/a nM
Citation Butler, CRBrodney, MABeck, EMBarreiro, GNolan, CEPan, FVajdos, FParris, KVarghese, AHHelal, CJLira, RDoran, SDRiddell, DRBuzon, LMDutra, JKMartinez-Alsina, LAOgilvie, KMurray, JCYoung, JMAtchison, KRobshaw, AGonzales, CWang, JZhang, YO'Neill, BT Discovery of a series of efficient, centrally efficacious BACE1 inhibitors through structure-based drug design. J Med Chem58:2678-702 (2015) 
 
Beta-secretase 1
Name:Beta-secretase 1
Type:Protein
Mol. Mass.:55755.10
Organism:Homo sapiens (Human)
Description:P56817
Residue:501
BDBM50078352
NameBDBM50078352
Synonyms:CHEMBL3414705
TypeSmall organic molecule
Emp. Form.C12H12F2N2OS
Mol. Mass.270.298
SMILES[H][C@@]12COC[C@@]1(N=C(N)SC2)c1ccc(F)cc1F