Reaction Details
TargetHepatocyte growth factor receptor
LigandBDBM50078377
Substrate/Competitorn/a
Meas. Tech.ChEMBL_1470881 (CHEMBL3418289)
IC50 1.000000±n/a nM
Citation Peterson, EATeffera, YAlbrecht, BKBauer, DBellon, SFBoezio, ABoezio, CBroome, MAChoquette, DCopeland, KWDussault, ILewis, RLin, MHLohman, JLiu, JPotashman, MRex, KShimanovich, RWhittington, DAVaida, KRHarmange, JC Discovery of potent and selective 8-fluorotriazolopyridine c-Met inhibitors. J Med Chem58:2417-30 (2015) 
 
Hepatocyte growth factor receptor
Name:Hepatocyte growth factor receptor
Type:Protein
Mol. Mass.:155559.73
Organism:Homo sapiens (Human)
Description:P08581
Residue:1390
BDBM50078377
NameBDBM50078377
Synonyms:CHEMBL3414922
TypeSmall organic molecule
Emp. Form.C22H19FN6O
Mol. Mass.402.4243
SMILESCOc1cnc2ccc(cc2c1)[C@H](C)c1nnc2c(F)cc(cn12)-c1cn(C)cn1