Reaction Details
TargetHepatocyte growth factor receptor
LigandBDBM50078381
Substrate/Competitorn/a
Meas. Tech.ChEMBL_1470881 (CHEMBL3418289)
IC50 2.0±n/a nM
Citation Peterson, EATeffera, YAlbrecht, BKBauer, DBellon, SFBoezio, ABoezio, CBroome, MAChoquette, DCopeland, KWDussault, ILewis, RLin, MHLohman, JLiu, JPotashman, MRex, KShimanovich, RWhittington, DAVaida, KRHarmange, JC Discovery of potent and selective 8-fluorotriazolopyridine c-Met inhibitors. J Med Chem58:2417-30 (2015) 
 
Hepatocyte growth factor receptor
Name:Hepatocyte growth factor receptor
Type:Protein
Mol. Mass.:155559.73
Organism:Homo sapiens (Human)
Description:P08581
Residue:1390
BDBM50078381
NameBDBM50078381
Synonyms:CHEMBL3414918
TypeSmall organic molecule
Emp. Form.C22H17F2N5O2
Mol. Mass.421.3995
SMILESCOc1cnc2ccc(cc2c1)[C@@](C)(F)c1nnc2c(F)cc(cn12)-c1cc(C)no1