Reaction Details
TargetAdenosine receptor A1
LigandBDBM50078427
Substrate/Competitorn/a
Meas. Tech.ChEMBL_1471048 (CHEMBL3420493)
EC50 3.6±n/a nM
Citation Petrelli, RTorquati, IKachler, SLuongo, LMaione, SFranchetti, PGrifantini, MNovellino, ELavecchia, AKlotz, KNCappellacci, L 5'-C-Ethyl-tetrazolyl-N(6)-substituted adenosine and 2-chloro-adenosine derivatives as highly potent dual acting A1 adenosine receptor agonists and A3 adenosine receptor antagonists. J Med Chem58:2560-6 (2015) 
 
Adenosine receptor A1
Name:Adenosine receptor A1
Type:G Protein-Coupled Receptor (GPCR)
Mol. Mass.:36520.92
Organism:Homo sapiens (Human)
Description:P30542
Residue:326
BDBM50078427
NameBDBM50078427
Synonyms:CHEMBL3414941
TypeSmall organic molecule
Emp. Form.C15H18ClN9O3
Mol. Mass.407.815
SMILESCCn1nnc(n1)[C@H]1O[C@H]([C@H](O)[C@@H]1O)n1cnc2c(NC3CC3)nc(Cl)nc12