Reaction Details
TargetAdenosine receptor A1
LigandBDBM50078428
Substrate/Competitorn/a
Meas. Tech.ChEMBL_1471048 (CHEMBL3420493)
EC50 4.7±n/a nM
Citation Petrelli, RTorquati, IKachler, SLuongo, LMaione, SFranchetti, PGrifantini, MNovellino, ELavecchia, AKlotz, KNCappellacci, L 5'-C-Ethyl-tetrazolyl-N(6)-substituted adenosine and 2-chloro-adenosine derivatives as highly potent dual acting A1 adenosine receptor agonists and A3 adenosine receptor antagonists. J Med Chem58:2560-6 (2015) 
 
Adenosine receptor A1
Name:Adenosine receptor A1
Type:G Protein-Coupled Receptor (GPCR)
Mol. Mass.:36520.92
Organism:Homo sapiens (Human)
Description:P30542
Residue:326
BDBM50078428
NameBDBM50078428
Synonyms:CHEMBL3414942
TypeSmall organic molecule
Emp. Form.C19H25N9O3
Mol. Mass.427.4603
SMILES[H][C@@]12CC[C@]([H])(C1)[C@H](C2)Nc1ncnc2n(cnc12)[C@@H]1O[C@@H]([C@@H](O)[C@H]1O)c1nnn(CC)n1