Reaction Details
TargetAdenosine receptor A1
LigandBDBM50078537
Substrate/Competitorn/a
Meas. Tech.ChEMBL_1471048 (CHEMBL3420493)
EC50 7.4±n/a nM
Citation Petrelli, RTorquati, IKachler, SLuongo, LMaione, SFranchetti, PGrifantini, MNovellino, ELavecchia, AKlotz, KNCappellacci, L 5'-C-Ethyl-tetrazolyl-N(6)-substituted adenosine and 2-chloro-adenosine derivatives as highly potent dual acting A1 adenosine receptor agonists and A3 adenosine receptor antagonists. J Med Chem58:2560-6 (2015) 
 
Adenosine receptor A1
Name:Adenosine receptor A1
Type:G Protein-Coupled Receptor (GPCR)
Mol. Mass.:36520.92
Organism:Homo sapiens (Human)
Description:P30542
Residue:326
BDBM50078537
NameBDBM50078537
Synonyms:CHEMBL3414945
TypeSmall organic molecule
Emp. Form.C16H20ClN9O4
Mol. Mass.437.841
SMILESCCn1nnc(n1)[C@H]1O[C@H]([C@H](O)[C@@H]1O)n1cnc2c(NC3CCCO3)nc(Cl)nc12