Reaction Details
TargetAdenosine receptor A3
LigandBDBM50078426
Substrate/Competitorn/a
Meas. Tech.ChEMBL_1471051 (CHEMBL3420496)
EC50 52±n/a nM
Citation Petrelli, RTorquati, IKachler, SLuongo, LMaione, SFranchetti, PGrifantini, MNovellino, ELavecchia, AKlotz, KNCappellacci, L 5'-C-Ethyl-tetrazolyl-N(6)-substituted adenosine and 2-chloro-adenosine derivatives as highly potent dual acting A1 adenosine receptor agonists and A3 adenosine receptor antagonists. J Med Chem58:2560-6 (2015) 
 
Adenosine receptor A3
Name:Adenosine receptor A3
Type:G Protein-Coupled Receptor (GPCR)
Mol. Mass.:36197.32
Organism:Homo sapiens (Human)
Description:P0DMS8
Residue:318
BDBM50078426
NameBDBM50078426
Synonyms:CHEMBL3414940
TypeSmall organic molecule
Emp. Form.C15H19N9O3
Mol. Mass.373.3699
SMILESCCn1nnc(n1)[C@H]1O[C@H]([C@H](O)[C@@H]1O)n1cnc2c(NC3CC3)ncnc12