Reaction Details
TargetAdenosine receptor A2a
LigandBDBM50078430
Substrate/Competitorn/a
Meas. Tech.ChEMBL_1471044 (CHEMBL3420489)
Ki 554±n/a nM
Citation Petrelli, RTorquati, IKachler, SLuongo, LMaione, SFranchetti, PGrifantini, MNovellino, ELavecchia, AKlotz, KNCappellacci, L 5'-C-Ethyl-tetrazolyl-N(6)-substituted adenosine and 2-chloro-adenosine derivatives as highly potent dual acting A1 adenosine receptor agonists and A3 adenosine receptor antagonists. J Med Chem58:2560-6 (2015) 
 
Adenosine receptor A2a
Name:Adenosine receptor A2a
Type:G Protein-Coupled Receptor (GPCR)
Mol. Mass.:44716.46
Organism:Homo sapiens (Human)
Description:P29274
Residue:412
BDBM50078430
NameBDBM50078430
Synonyms:CHEMBL3414944
TypeSmall organic molecule
Emp. Form.C16H21N9O4
Mol. Mass.403.3958
SMILESCCn1nnc(n1)[C@H]1O[C@H]([C@H](O)[C@@H]1O)n1cnc2c(NC3CCCO3)ncnc12