Reaction Details
TargetAdenosine receptor A3
LigandBDBM50078429
Substrate/Competitorn/a
Meas. Tech.ChEMBL_1471045 (CHEMBL3420490)
Ki 16±n/a nM
Citation Petrelli, RTorquati, IKachler, SLuongo, LMaione, SFranchetti, PGrifantini, MNovellino, ELavecchia, AKlotz, KNCappellacci, L 5'-C-Ethyl-tetrazolyl-N(6)-substituted adenosine and 2-chloro-adenosine derivatives as highly potent dual acting A1 adenosine receptor agonists and A3 adenosine receptor antagonists. J Med Chem58:2560-6 (2015) 
 
Adenosine receptor A3
Name:Adenosine receptor A3
Type:G Protein-Coupled Receptor (GPCR)
Mol. Mass.:36197.32
Organism:Homo sapiens (Human)
Description:P0DMS8
Residue:318
BDBM50078429
NameBDBM50078429
Synonyms:CHEMBL3414943
TypeSmall organic molecule
Emp. Form.C19H24ClN9O3
Mol. Mass.461.905
SMILES[H][C@@]12CC[C@]([H])(C1)[C@H](C2)Nc1nc(Cl)nc2n(cnc12)[C@@H]1O[C@@H]([C@@H](O)[C@H]1O)c1nnn(CC)n1