Reaction Details
TargetCarbonic anhydrase 2
LigandBDBM50078670
Substrate/Competitorn/a
Meas. Tech.ChEMBL_1471415 (CHEMBL3419422)
IC50 156±n/a nM
Citation Huang, QRui, EYCobbs, MDinh, DMGukasyan, HJLafontaine, JAMehta, SPatterson, BDRewolinski, DARichardson, PFEdwards, MP Design, synthesis, and evaluation of NO-donor containing carbonic anhydrase inhibitors to lower intraocular pressure. J Med Chem58:2821-33 (2015) 
 
Carbonic anhydrase 2
Name:Carbonic anhydrase 2
Type:Enzyme
Mol. Mass.:29250.71
Organism:Homo sapiens (Human)
Description:P00918
Residue:260
BDBM50078670
NameBDBM50078670
Synonyms:CHEMBL3415381
TypeSmall organic molecule
Emp. Form.C10H15N3O7S3
Mol. Mass.385.437
SMILESCCN[C@H]1C[C@H](CO[N+]([O-])=O)S(=O)(=O)c2sc(cc12)S(N)(=O)=O