Reaction Details
TargetCarbonic anhydrase 2
LigandBDBM50078671
Substrate/Competitorn/a
Meas. Tech.ChEMBL_1471414 (CHEMBL3419421)
Kd 0.034000±n/a nM
Citation Huang, QRui, EYCobbs, MDinh, DMGukasyan, HJLafontaine, JAMehta, SPatterson, BDRewolinski, DARichardson, PFEdwards, MP Design, synthesis, and evaluation of NO-donor containing carbonic anhydrase inhibitors to lower intraocular pressure. J Med Chem58:2821-33 (2015) 
 
Carbonic anhydrase 2
Name:Carbonic anhydrase 2
Type:Enzyme
Mol. Mass.:29250.71
Organism:Homo sapiens (Human)
Description:P00918
Residue:260
BDBM50078671
NameBDBM50078671
Synonyms:CHEMBL3415380
TypeSmall organic molecule
Emp. Form.C11H17N3O7S3
Mol. Mass.399.464
SMILESCCN[C@H]1C[C@H](CCO[N+]([O-])=O)S(=O)(=O)c2sc(cc12)S(N)(=O)=O