Reaction Details
TargetHistone deacetylase 6
LigandBDBM50078687
Substrate/Competitorn/a
Meas. Tech.ChEMBL_1471542 (CHEMBL3420277)
IC50 63±n/a nM
Citation Lin, XChen, WQiu, ZGuo, LZhu, WLi, WWang, ZZhang, WZhang, ZRong, YZhang, MYu, LZhong, SZhao, RWu, XWong, JCTang, G Design and synthesis of orally bioavailable aminopyrrolidinone histone deacetylase 6 inhibitors. J Med Chem58:2809-20 (2015) 
 
Histone deacetylase 6
Name:Histone deacetylase 6
Type:Chromatin regulator; hydrolase; repressor
Mol. Mass.:131381.51
Organism:Homo sapiens (Human)
Description:Q9UBN7
Residue:1215
BDBM50078687
NameBDBM50078687
Synonyms:CHEMBL3415619
TypeSmall organic molecule
Emp. Form.C17H15Cl2N3O3
Mol. Mass.380.225
SMILESONC(=O)c1ccc(NC2CCN(C2=O)c2ccc(Cl)c(Cl)c2)cc1