Reaction Details
TargetHistone deacetylase 6
LigandBDBM50078681
Substrate/Competitorn/a
Meas. Tech.ChEMBL_1471540 (CHEMBL3420275)
EC50 6700±n/a nM
Citation Lin, XChen, WQiu, ZGuo, LZhu, WLi, WWang, ZZhang, WZhang, ZRong, YZhang, MYu, LZhong, SZhao, RWu, XWong, JCTang, G Design and synthesis of orally bioavailable aminopyrrolidinone histone deacetylase 6 inhibitors. J Med Chem58:2809-20 (2015) 
 
Histone deacetylase 6
Name:Histone deacetylase 6
Type:Chromatin regulator; hydrolase; repressor
Mol. Mass.:131381.51
Organism:Homo sapiens (Human)
Description:Q9UBN7
Residue:1215
BDBM50078681
NameBDBM50078681
Synonyms:CHEMBL3415456
TypeSmall organic molecule
Emp. Form.C17H16ClN3O3
Mol. Mass.345.78
SMILESONC(=O)c1ccc(NC2CCN(C2=O)c2ccccc2Cl)cc1