Reaction Details
TargetHistone deacetylase 6
LigandBDBM50078747
Substrate/Competitorn/a
Meas. Tech.ChEMBL_1471540 (CHEMBL3420275)
EC50 360±n/a nM
Citation Lin, XChen, WQiu, ZGuo, LZhu, WLi, WWang, ZZhang, WZhang, ZRong, YZhang, MYu, LZhong, SZhao, RWu, XWong, JCTang, G Design and synthesis of orally bioavailable aminopyrrolidinone histone deacetylase 6 inhibitors. J Med Chem58:2809-20 (2015) 
 
Histone deacetylase 6
Name:Histone deacetylase 6
Type:Chromatin regulator; hydrolase; repressor
Mol. Mass.:131381.51
Organism:Homo sapiens (Human)
Description:Q9UBN7
Residue:1215
BDBM50078747
NameBDBM50078747
Synonyms:CHEMBL3415628
TypeSmall organic molecule
Emp. Form.C21H20N4O3
Mol. Mass.376.4085
SMILESCC1(CCN(C1=O)c1ccc2ncccc2c1)Nc1ccc(cc1)C(=O)NO