Reaction Details
TargetPolyunsaturated fatty acid 5-lipoxygenase
LigandBDBM50078872
Substrate/Competitorn/a
Meas. Tech.ChEMBL_1472476 (CHEMBL3420629)
IC50 310±n/a nM
Citation Filosa, RPeduto, ASchaible, AMKrauth, VWeinigel, CBarz, DPetronzi, CBruno, FRoviezzo, FSpaziano, GD'Agostino, BDe Rosa, MWerz, O Novel series of benzoquinones with high potency against 5-lipoxygenase in human polymorphonuclear leukocytes. Eur J Med Chem94:132-9 (2015) 
 
Polyunsaturated fatty acid 5-lipoxygenase
Name:Polyunsaturated fatty acid 5-lipoxygenase
Type:Enzyme
Mol. Mass.:77972.74
Organism:Homo sapiens (Human)
Description:Recombinant protein was purified from E. coli lysate. After ammonium sulfate precipitation and subsequent steps, the supernatant (S100) was used for 5-LO activity assay.
Residue:674
BDBM50078872
NameBDBM50078872
Synonyms:CHEMBL3416353
TypeSmall organic molecule
Emp. Form.C23H32O4
Mol. Mass.372.4978
SMILES[#6]-[#8]-[#6]-1=[#6]-[#6](=O)-[#6](-[#8]-[#6])=[#6](-[#6]\[#6]=[#6](/[#6])-[#6]-[#6]\[#6]=[#6](/[#6])-[#6]-[#6]\[#6]=[#6](\[#6])-[#6])-[#6]-1=O