Reaction Details
TargetPolyunsaturated fatty acid 5-lipoxygenase
LigandBDBM50078873
Substrate/Competitorn/a
Meas. Tech.ChEMBL_1472476 (CHEMBL3420629)
IC50 2200±n/a nM
Citation Filosa, RPeduto, ASchaible, AMKrauth, VWeinigel, CBarz, DPetronzi, CBruno, FRoviezzo, FSpaziano, GD'Agostino, BDe Rosa, MWerz, O Novel series of benzoquinones with high potency against 5-lipoxygenase in human polymorphonuclear leukocytes. Eur J Med Chem94:132-9 (2015) 
 
Polyunsaturated fatty acid 5-lipoxygenase
Name:Polyunsaturated fatty acid 5-lipoxygenase
Type:Enzyme
Mol. Mass.:77972.74
Organism:Homo sapiens (Human)
Description:Recombinant protein was purified from E. coli lysate. After ammonium sulfate precipitation and subsequent steps, the supernatant (S100) was used for 5-LO activity assay.
Residue:674
BDBM50078873
NameBDBM50078873
Synonyms:CHEMBL3416354
TypeSmall organic molecule
Emp. Form.C12H16O4
Mol. Mass.224.253
SMILESCCCCC1=C(OC)C(OC)=CC(=O)C1=O