Reaction Details
TargetPolyunsaturated fatty acid 5-lipoxygenase
LigandBDBM50078853
Substrate/Competitorn/a
Meas. Tech.ChEMBL_1472478 (CHEMBL3420867)
IC50>10000±n/a nM
Citation Filosa, RPeduto, ASchaible, AMKrauth, VWeinigel, CBarz, DPetronzi, CBruno, FRoviezzo, FSpaziano, GD'Agostino, BDe Rosa, MWerz, O Novel series of benzoquinones with high potency against 5-lipoxygenase in human polymorphonuclear leukocytes. Eur J Med Chem94:132-9 (2015) 
 
Polyunsaturated fatty acid 5-lipoxygenase
Name:Polyunsaturated fatty acid 5-lipoxygenase
Type:Enzyme
Mol. Mass.:77972.74
Organism:Homo sapiens (Human)
Description:Recombinant protein was purified from E. coli lysate. After ammonium sulfate precipitation and subsequent steps, the supernatant (S100) was used for 5-LO activity assay.
Residue:674
BDBM50078853
NameBDBM50078853
Synonyms:CHEMBL3263323
TypeSmall organic molecule
Emp. Form.C12H16O4
Mol. Mass.224.253
SMILESCCCCCCC1=C(O)C(=O)C=C(O)C1=O