Reaction Details
TargetMacrophage-expressed gene 1 protein
LigandBDBM50078850
Substrate/Competitorn/a
Meas. Tech.ChEMBL_1472484 (CHEMBL3420873)
IC50 210±n/a nM
Citation Filosa, RPeduto, ASchaible, AMKrauth, VWeinigel, CBarz, DPetronzi, CBruno, FRoviezzo, FSpaziano, GD'Agostino, BDe Rosa, MWerz, O Novel series of benzoquinones with high potency against 5-lipoxygenase in human polymorphonuclear leukocytes. Eur J Med Chem94:132-9 (2015) 
 
Macrophage-expressed gene 1 protein
Name:Macrophage-expressed gene 1 protein
Type:PROTEIN
Mol. Mass.:78593.74
Organism:Homo sapiens (Human)
Description:ChEMBL_109592
Residue:716
BDBM50078850
NameBDBM50078850
Synonyms:CHEBI:4778 | Embelin
TypeSmall organic molecule
Emp. Form.C17H26O4
Mol. Mass.294.3859
SMILESCCCCCCCCCCCC1=C(O)C(=O)C=C(O)C1=O