Reaction Details
TargetMacrophage-expressed gene 1 protein
LigandBDBM50078864
Substrate/Competitorn/a
Meas. Tech.ChEMBL_1472482 (CHEMBL3420871)
IC50>10000±n/a nM
Citation Filosa, RPeduto, ASchaible, AMKrauth, VWeinigel, CBarz, DPetronzi, CBruno, FRoviezzo, FSpaziano, GD'Agostino, BDe Rosa, MWerz, O Novel series of benzoquinones with high potency against 5-lipoxygenase in human polymorphonuclear leukocytes. Eur J Med Chem94:132-9 (2015) 
 
Macrophage-expressed gene 1 protein
Name:Macrophage-expressed gene 1 protein
Type:PROTEIN
Mol. Mass.:78593.74
Organism:Homo sapiens (Human)
Description:ChEMBL_109592
Residue:716
BDBM50078864
NameBDBM50078864
Synonyms:CHEMBL2228913
TypeSmall organic molecule
Emp. Form.C18H28O4
Mol. Mass.308.4125
SMILESCCCCCCCCCCC1=C(OC)C(=O)C=C(OC)C1=O