Reaction Details
TargetMacrophage-expressed gene 1 protein
LigandBDBM50078875
Substrate/Competitorn/a
Meas. Tech.ChEMBL_1472482 (CHEMBL3420871)
IC50>10000±n/a nM
Citation Filosa, RPeduto, ASchaible, AMKrauth, VWeinigel, CBarz, DPetronzi, CBruno, FRoviezzo, FSpaziano, GD'Agostino, BDe Rosa, MWerz, O Novel series of benzoquinones with high potency against 5-lipoxygenase in human polymorphonuclear leukocytes. Eur J Med Chem94:132-9 (2015) 
 
Macrophage-expressed gene 1 protein
Name:Macrophage-expressed gene 1 protein
Type:PROTEIN
Mol. Mass.:78593.74
Organism:Homo sapiens (Human)
Description:ChEMBL_109592
Residue:716
BDBM50078875
NameBDBM50078875
Synonyms:CHEMBL3416356
TypeSmall organic molecule
Emp. Form.C16H24O4
Mol. Mass.280.3594
SMILESCCCCCCCCC1=C(OC)C(OC)=CC(=O)C1=O