Reaction Details
TargetMacrophage-expressed gene 1 protein
LigandBDBM50078883
Substrate/Competitorn/a
Meas. Tech.ChEMBL_1472482 (CHEMBL3420871)
IC50>10000±n/a nM
Citation Filosa, RPeduto, ASchaible, AMKrauth, VWeinigel, CBarz, DPetronzi, CBruno, FRoviezzo, FSpaziano, GD'Agostino, BDe Rosa, MWerz, O Novel series of benzoquinones with high potency against 5-lipoxygenase in human polymorphonuclear leukocytes. Eur J Med Chem94:132-9 (2015) 
 
Macrophage-expressed gene 1 protein
Name:Macrophage-expressed gene 1 protein
Type:PROTEIN
Mol. Mass.:78593.74
Organism:Homo sapiens (Human)
Description:ChEMBL_109592
Residue:716
BDBM50078883
NameBDBM50078883
Synonyms:CHEMBL3416365
TypeSmall organic molecule
Emp. Form.C23H32O4
Mol. Mass.372.4978
SMILES[#6]-[#8]-[#6]-1=[#6]-[#6](=O)-[#6](=O)-[#6](-[#6]\[#6]=[#6](/[#6])-[#6]-[#6]\[#6]=[#6](/[#6])-[#6]-[#6]\[#6]=[#6](\[#6])-[#6])=[#6]-1-[#8]-[#6]