Reaction Details
TargetAmine oxidase [flavin-containing] A
LigandBDBM50240772
Substrate/Competitorn/a
Meas. Tech.ChEMBL_1472635 (CHEMBL3418204)
IC50 1070±n/a nM
Citation Valente, SRodriguez, VMercurio, CVianello, PSaponara, BCirilli, RCiossani, GLabella, DMarrocco, BMonaldi, DRuoppolo, GTilset, MBotrugno, OADessanti, PMinucci, SMattevi, AVarasi, MMai, A Pure enantiomers of benzoylamino-tranylcypromine: LSD1 inhibition, gene modulation in human leukemia cells and effects on clonogenic potential of murine promyelocytic blasts. Eur J Med Chem94:163-74 (2015) 
 
Amine oxidase [flavin-containing] A
Name:Amine oxidase [flavin-containing] A
Type:Protein
Mol. Mass.:59689.53
Organism:Homo sapiens (Human)
Description:P21397
Residue:527
BDBM50240772
NameBDBM50240772
Synonyms:(1R,2S)-(-)-2-phenylcyclopropylamine (tranylcypromine)2-Phenyl-cyclopropylamine CHEMBL1179 TRANYLCYPROMINE US10836743, Compound TCP US9180183, Tranylcypromine rel-Tranylcypromine
TypeSmall organic molecule
Emp. Form.C9H11N
Mol. Mass.133.1903
SMILESN[C@@H]1C[C@H]1c1ccccc1