Reaction Details
TargetAmine oxidase [flavin-containing] A
LigandBDBM50078892
Substrate/Competitorn/a
Meas. Tech.ChEMBL_1472635 (CHEMBL3418204)
IC50 70±n/a nM
Citation Valente, SRodriguez, VMercurio, CVianello, PSaponara, BCirilli, RCiossani, GLabella, DMarrocco, BMonaldi, DRuoppolo, GTilset, MBotrugno, OADessanti, PMinucci, SMattevi, AVarasi, MMai, A Pure enantiomers of benzoylamino-tranylcypromine: LSD1 inhibition, gene modulation in human leukemia cells and effects on clonogenic potential of murine promyelocytic blasts. Eur J Med Chem94:163-74 (2015) 
 
Amine oxidase [flavin-containing] A
Name:Amine oxidase [flavin-containing] A
Type:Protein
Mol. Mass.:59689.53
Organism:Homo sapiens (Human)
Description:P21397
Residue:527
BDBM50078892
NameBDBM50078892
Synonyms:CHEMBL3416434
TypeSmall organic molecule
Emp. Form.C16H17ClN2O
Mol. Mass.288.772
SMILESCl.N[C@H]1C[C@H]1c1cccc(NC(=O)c2ccccc2)c1