Reaction Details
TargetLysine-specific histone demethylase 1A
LigandBDBM50078894
Substrate/Competitorn/a
Meas. Tech.ChEMBL_1472633 (CHEMBL3418202)
IC50 26±n/a nM
Citation Valente, SRodriguez, VMercurio, CVianello, PSaponara, BCirilli, RCiossani, GLabella, DMarrocco, BMonaldi, DRuoppolo, GTilset, MBotrugno, OADessanti, PMinucci, SMattevi, AVarasi, MMai, A Pure enantiomers of benzoylamino-tranylcypromine: LSD1 inhibition, gene modulation in human leukemia cells and effects on clonogenic potential of murine promyelocytic blasts. Eur J Med Chem94:163-74 (2015) 
 
Lysine-specific histone demethylase 1A
Name:Lysine-specific histone demethylase 1A
Type:Enzyme
Mol. Mass.:92901.01
Organism:Homo sapiens (Human)
Description:O60341
Residue:852
BDBM50078894
NameBDBM50078894
Synonyms:CHEMBL3416431
TypeSmall organic molecule
Emp. Form.C16H17ClN2O
Mol. Mass.288.772
SMILESCl.N[C@@H]1C[C@@H]1c1ccc(NC(=O)c2ccccc2)cc1