Reaction Details
TargetPeroxisome proliferator-activated receptor delta
LigandBDBM50383373
Substrate/Competitorn/a
Meas. Tech.ChEMBL_1472809 (CHEMBL3419309)
IC50 155±n/a nM
Citation Kaupang, ÅPaulsen, SMSteindal, CCRavna, AWSylte, IHalvorsen, TGThoresen, GHHansen, TV Synthesis, biological evaluation and molecular modeling studies of the PPARß/d antagonist CC618. Eur J Med Chem94:229-36 (2015) 
 
Peroxisome proliferator-activated receptor delta
Name:Peroxisome proliferator-activated receptor delta
Type:Enzyme
Mol. Mass.:49910.45
Organism:Homo sapiens (Human)
Description:Q03181
Residue:441
BDBM50383373
NameBDBM50383373
Synonyms:CHEMBL592652 | GSK0660
TypeSmall organic molecule
Emp. Form.C19H18N2O5S2
Mol. Mass.418.487
SMILESCOC(=O)c1sccc1S(=O)(=O)Nc1ccc(Nc2ccccc2)cc1OC