Reaction Details
TargetAdenosine receptor A3
LigandBDBM35804
Substrate/Competitorn/a
Meas. Tech.ChEMBL_1472827 (CHEMBL3419489)
Ki 384±n/a nM
Citation Preti, DBaraldi, PGSaponaro, GRomagnoli, RAghazadeh Tabrizi, MBaraldi, SCosconati, SBruno, ANovellino, EVincenzi, FRavani, ABorea, PAVarani, K Design, synthesis, and biological evaluation of novel 2-((2-(4-(substituted)phenylpiperazin-1-yl)ethyl)amino)-5'-N-ethylcarboxamidoadenosines as potent and selective agonists of the A2A adenosine receptor. J Med Chem58:3253-67 (2015) 
 
Adenosine receptor A3
Name:Adenosine receptor A3
Type:G Protein-Coupled Receptor (GPCR)
Mol. Mass.:36197.32
Organism:Homo sapiens (Human)
Description:P0DMS8
Residue:318
BDBM35804
NameBDBM35804
Synonyms:(CGS21680) 3-(4-{2-[6-Amino-9-(5-ethylcarbamoylmethyl-3,4-dihydroxy-tetrahydro-furan-2-yl)-9H-purin-2-ylamino]-ethyl}-phenyl)-propionic acid 2-[4-(2-carboxyethyl)phenethylamino]-5''''-N-ethylcarboxamidoadenosine 3-(4-(2-(6-amino-9-((2R,3R,4S,5S)-5-(ethylcarbamoyl)-3,4-dihydroxy-tetrahydrofuran-2-yl)-9H-purin-2-ylamino)ethyl)phenyl)propanoic acid 3-(4-{2-[6-Amino-9-((2R,3R,4S,5S)-5-ethylcarbamoyl-3,4-dihydroxy-tetrahydro-furan-2-yl)-9H-purin-2-ylamino]-ethyl}-phenyl)-propionic acid CGS-21680 [3H]-CGS 21680
Typeradiolabeled ligand
Emp. Form.C23H29N7O6
Mol. Mass.499.5197
SMILESCCNC(=O)[C@H]1O[C@H]([C@H](O)[C@@H]1O)n1cnc2c(N)nc(NCCc3ccc(CCC(O)=O)cc3)nc12