Reaction Details
TargetAdenosine receptor A2a
LigandBDBM50079321
Substrate/Competitorn/a
Meas. Tech.ChEMBL_1472822 (CHEMBL3419484)
Ki 4.8±n/a nM
Citation Preti, DBaraldi, PGSaponaro, GRomagnoli, RAghazadeh Tabrizi, MBaraldi, SCosconati, SBruno, ANovellino, EVincenzi, FRavani, ABorea, PAVarani, K Design, synthesis, and biological evaluation of novel 2-((2-(4-(substituted)phenylpiperazin-1-yl)ethyl)amino)-5'-N-ethylcarboxamidoadenosines as potent and selective agonists of the A2A adenosine receptor. J Med Chem58:3253-67 (2015) 
 
Adenosine receptor A2a
Name:Adenosine receptor A2a
Type:G Protein-Coupled Receptor (GPCR)
Mol. Mass.:44716.46
Organism:Homo sapiens (Human)
Description:P29274
Residue:412
BDBM50079321
NameBDBM50079321
Synonyms:CHEMBL3416799
TypeSmall organic molecule
Emp. Form.C24H31ClFN9O4
Mol. Mass.564.012
SMILESCCNC(=O)[C@H]1O[C@H]([C@H](O)[C@@H]1O)n1cnc2c(N)nc(NCCN3CCN(CC3)c3ccc(Cl)cc3F)nc12