Reaction Details
TargetCell division protein FtsZ
LigandBDBM50079358
Substrate/Competitorn/a
Meas. Tech.ChEMBL_1470491 (CHEMBL3419208)
IC50 12000±n/a nM
Citation Li, XMa, S Advances in the discovery of novel antimicrobials targeting the assembly of bacterial cell division protein FtsZ. Eur J Med Chem95:1-15 (2015) 
 
Cell division protein FtsZ
Name:Cell division protein FtsZ
Type:Protein
Mol. Mass.:40305.83
Organism:Escherichia coli
Description:P0A9A6
Residue:383
BDBM50079358
NameBDBM50079358
Synonyms:CHEMBL3416948
TypeSmall organic molecule
Emp. Form.C24H23ClN4
Mol. Mass.402.919
SMILESCN(C)CCNc1nc(\C=C\c2ccc(Cl)cc2)nc2cc3ccccc3cc12