Reaction Details
TargetCell division protein FtsZ
LigandBDBM50439495
Substrate/Competitorn/a
Meas. Tech.ChEMBL_1470447 (CHEMBL3418981)
IC50 9870±n/a nM
Citation Li, XMa, S Advances in the discovery of novel antimicrobials targeting the assembly of bacterial cell division protein FtsZ. Eur J Med Chem95:1-15 (2015) 
 
Cell division protein FtsZ
Name:Cell division protein FtsZ
Type:Protein
Mol. Mass.:40305.83
Organism:Escherichia coli
Description:P0A9A6
Residue:383
BDBM50439495
NameBDBM50439495
Synonyms:CHEMBL2418095
TypeSmall organic molecule
Emp. Form.C32H24Cl4O8
Mol. Mass.678.34
SMILESOc1cc(O)c2Oc3cc(C\C=C(Cl)/Cc4cc(O)c(Oc5cc(C\C=C(Cl)/Cc2c1)c(O)cc5Cl)c(O)c4)c(O)cc3Cl