Reaction Details
TargetHigh affinity nerve growth factor receptor
LigandBDBM50073587
Substrate/Competitorn/a
Meas. Tech.ChEMBL_1470623 (CHEMBL3420210)
EC50 84±n/a nM
Citation Yu, BYu, ZQi, PPYu, DQLiu, HM Discovery of orally active anticancer candidate CFI-400945 derived from biologically promising spirooxindoles: success and challenges. Eur J Med Chem95:35-40 (2015) 
 
High affinity nerve growth factor receptor
Name:High affinity nerve growth factor receptor
Type:n/a
Mol. Mass.:87498.18
Organism:Homo sapiens (Human)
Description:P04629
Residue:796
BDBM50073587
NameBDBM50073587
Synonyms:CHEMBL3408947 US20230365537, Example CFI-400495 | US9907800, Example A185
TypeSmall organic molecule
Emp. Form.C33H34N4O3
Mol. Mass.534.6481
SMILESCOc1ccc2NC(=O)[C@@]3(C[C@H]3c3ccc4c(\C=C\c5ccc(CN6C[C@H](C)O[C@H](C)C6)cc5)n[nH]c4c3)c2c1