Reaction Details
TargetAurora kinase A
LigandBDBM50073587
Substrate/Competitorn/a
Meas. Tech.ChEMBL_1470618 (CHEMBL3420205)
EC50 510±n/a nM
Citation Yu, BYu, ZQi, PPYu, DQLiu, HM Discovery of orally active anticancer candidate CFI-400945 derived from biologically promising spirooxindoles: success and challenges. Eur J Med Chem95:35-40 (2015) 
 
Aurora kinase A
Name:Aurora kinase A
Type:Serine/threonine-protein kinase
Mol. Mass.:45830.98
Organism:Homo sapiens (Human)
Description:O14965
Residue:403
BDBM50073587
NameBDBM50073587
Synonyms:CHEMBL3408947 US20230365537, Example CFI-400495 | US9907800, Example A185
TypeSmall organic molecule
Emp. Form.C33H34N4O3
Mol. Mass.534.6481
SMILESCOc1ccc2NC(=O)[C@@]3(C[C@H]3c3ccc4c(\C=C\c5ccc(CN6C[C@H](C)O[C@H](C)C6)cc5)n[nH]c4c3)c2c1