Reaction Details
Target5-hydroxytryptamine receptor 4
LigandBDBM50079363
Substrate/Competitorn/a
Meas. Tech.ChEMBL_1470633 (CHEMBL3420220)
Ki 15±n/a nM
Citation Rochais, CLecoutey, CGaven, FGiannoni, PHamidouche, KHedou, DDubost, EGenest, DYahiaoui, SFreret, TBouet, VDauphin, FSopkova de Oliveira Santos, JBallandonne, CCorvaisier, SMalzert-Fréon, ALegay, RBoulouard, MClaeysen, SDallemagne, P Novel multitarget-directed ligands (MTDLs) with acetylcholinesterase (AChE) inhibitory and serotonergic subtype 4 receptor (5-HT4R) agonist activities as potential agents against Alzheimer's disease: the design of donecopride. J Med Chem58:3172-87 (2015) 
 
5-hydroxytryptamine receptor 4
Name:5-hydroxytryptamine receptor 4
Type:Enzyme Catalytic Domain
Mol. Mass.:43735.29
Organism:GUINEA PIG
Description:5-HT4 HTR4 GUINEA PIG::O70528
Residue:388
BDBM50079363
NameBDBM50079363
Synonyms:CHEMBL3414597 | US9663465, 6
TypeSmall organic molecule
Emp. Form.C19H27ClN2O2
Mol. Mass.350.883
SMILESCOc1cc(N)c(Cl)cc1C(=O)CCC1CCN(CC2CC2)CC1