Reaction Details
TargetMAP kinase-interacting serine/threonine-protein kinase 2
LigandBDBM50079402
Substrate/Competitorn/a
Meas. Tech.ChEMBL_1470961 (CHEMBL3419829)
Ki 1600±n/a nM
Citation Yu, MLi, PBasnet, SKKumarasiri, MDiab, STeo, TAlbrecht, HWang, S Discovery of 4-(dihydropyridinon-3-yl)amino-5-methylthieno[2,3-d]pyrimidine derivatives as potent Mnk inhibitors: synthesis, structure-activity relationship analysis and biological evaluation. Eur J Med Chem95:116-26 (2015) 
 
MAP kinase-interacting serine/threonine-protein kinase 2
Name:MAP kinase-interacting serine/threonine-protein kinase 2
Type:Protein
Mol. Mass.:51870.79
Organism:Homo sapiens (Human)
Description:Q9HBH9
Residue:465
BDBM50079402
NameBDBM50079402
Synonyms:CHEMBL3417208
TypeSmall organic molecule
Emp. Form.C14H13N5O2S
Mol. Mass.315.35
SMILESCc1c(sc2ncnc(Nc3ccc(=O)n(C)c3)c12)C(N)=O