Reaction Details
TargetMAP kinase-interacting serine/threonine-protein kinase 1
LigandBDBM50079471
Substrate/Competitorn/a
Meas. Tech.ChEMBL_1470960 (CHEMBL3419828)
Ki 4820±n/a nM
Citation Yu, MLi, PBasnet, SKKumarasiri, MDiab, STeo, TAlbrecht, HWang, S Discovery of 4-(dihydropyridinon-3-yl)amino-5-methylthieno[2,3-d]pyrimidine derivatives as potent Mnk inhibitors: synthesis, structure-activity relationship analysis and biological evaluation. Eur J Med Chem95:116-26 (2015) 
 
MAP kinase-interacting serine/threonine-protein kinase 1
Name:MAP kinase-interacting serine/threonine-protein kinase 1
Type:Serine/threonine-protein kinase
Mol. Mass.:51342.85
Organism:Homo sapiens (Human)
Description:Q9BUB5
Residue:465
BDBM50079471
NameBDBM50079471
Synonyms:CHEMBL3417198
TypeSmall organic molecule
Emp. Form.C15H14N4O3S
Mol. Mass.330.362
SMILESCc1c(sc2ncnc(Nc3cc(C)cn(C)c3=O)c12)C(O)=O