Reaction Details
TargetHistone deacetylase 2
LigandBDBM50079474
Substrate/Competitorn/a
Meas. Tech.ChEMBL_1471124 (CHEMBL3421014)
IC50>34300±n/a nM
Citation Zhang, XKong, YZhang, JSu, MZhou, YZang, YLi, JChen, YFang, YZhang, XLu, W Design, synthesis and biological evaluation of colchicine derivatives as novel tubulin and histone deacetylase dual inhibitors. Eur J Med Chem95:127-35 (2015) 
 
Histone deacetylase 2
Name:Histone deacetylase 2
Type:Chromatin regulator; hydrolase; repressor
Mol. Mass.:55356.54
Organism:Homo sapiens (Human)
Description:Q92769
Residue:488
BDBM50079474
NameBDBM50079474
Synonyms:CHEMBL3417215
TypeSmall organic molecule
Emp. Form.C34H35N3O6
Mol. Mass.581.6582
SMILESCOc1cc2CC[C@H](NCc3cccc(c3)C(=O)Nc3ccccc3N)c3cc(=O)c(OC)ccc3-c2c(OC)c1OC