Reaction Details
TargetHistone deacetylase 1
LigandBDBM50079493
Substrate/Competitorn/a
Meas. Tech.ChEMBL_1471123 (CHEMBL3421013)
IC50 12500±n/a nM
Citation Zhang, XKong, YZhang, JSu, MZhou, YZang, YLi, JChen, YFang, YZhang, XLu, W Design, synthesis and biological evaluation of colchicine derivatives as novel tubulin and histone deacetylase dual inhibitors. Eur J Med Chem95:127-35 (2015) 
 
Histone deacetylase 1
Name:Histone deacetylase 1
Type:Enzyme
Mol. Mass.:55090.27
Organism:Homo sapiens (Human)
Description:Q13547
Residue:482
BDBM50079493
NameBDBM50079493
Synonyms:CHEMBL3417213
TypeSmall organic molecule
Emp. Form.C34H35N3O6
Mol. Mass.581.6582
SMILESCOc1cc2CC[C@H](NCc3ccc(cc3)C(=O)Nc3ccccc3N)c3cc(=O)c(OC)ccc3-c2c(OC)c1OC