Reaction Details
TargetHistone deacetylase 2
LigandBDBM50079494
Substrate/Competitorn/a
Meas. Tech.ChEMBL_1471124 (CHEMBL3421014)
IC50 5410±n/a nM
Citation Zhang, XKong, YZhang, JSu, MZhou, YZang, YLi, JChen, YFang, YZhang, XLu, W Design, synthesis and biological evaluation of colchicine derivatives as novel tubulin and histone deacetylase dual inhibitors. Eur J Med Chem95:127-35 (2015) 
 
Histone deacetylase 2
Name:Histone deacetylase 2
Type:Chromatin regulator; hydrolase; repressor
Mol. Mass.:55356.54
Organism:Homo sapiens (Human)
Description:Q92769
Residue:488
BDBM50079494
NameBDBM50079494
Synonyms:CHEMBL3417292
TypeSmall organic molecule
Emp. Form.C38H37N3O6S
Mol. Mass.663.782
SMILESCOc1cc2CC[C@H](NCc3cccc(c3)C(=O)Nc3cc(ccc3N)-c3cccs3)c3cc(=O)c(OC)ccc3-c2c(OC)c1OC