Reaction Details
TargetHistone deacetylase 2
LigandBDBM50079498
Substrate/Competitorn/a
Meas. Tech.ChEMBL_1471124 (CHEMBL3421014)
IC50 4910±n/a nM
Citation Zhang, XKong, YZhang, JSu, MZhou, YZang, YLi, JChen, YFang, YZhang, XLu, W Design, synthesis and biological evaluation of colchicine derivatives as novel tubulin and histone deacetylase dual inhibitors. Eur J Med Chem95:127-35 (2015) 
 
Histone deacetylase 2
Name:Histone deacetylase 2
Type:Chromatin regulator; hydrolase; repressor
Mol. Mass.:55356.54
Organism:Homo sapiens (Human)
Description:Q92769
Residue:488
BDBM50079498
NameBDBM50079498
Synonyms:CHEMBL3417211
TypeSmall organic molecule
Emp. Form.C34H33N3O7
Mol. Mass.595.6417
SMILESCOc1cc2CC[C@H](NC(=O)c3cccc(c3)C(=O)Nc3ccccc3N)c3cc(=O)c(OC)ccc3-c2c(OC)c1OC