Reaction Details
TargetHistone deacetylase 3
LigandBDBM50079499
Substrate/Competitorn/a
Meas. Tech.ChEMBL_1471125 (CHEMBL3421015)
IC50 1490±n/a nM
Citation Zhang, XKong, YZhang, JSu, MZhou, YZang, YLi, JChen, YFang, YZhang, XLu, W Design, synthesis and biological evaluation of colchicine derivatives as novel tubulin and histone deacetylase dual inhibitors. Eur J Med Chem95:127-35 (2015) 
 
Histone deacetylase 3
Name:Histone deacetylase 3
Type:Enzyme
Mol. Mass.:48829.55
Organism:Homo sapiens (Human)
Description:O15379
Residue:428
BDBM50079499
NameBDBM50079499
Synonyms:CHEMBL3417212
TypeSmall organic molecule
Emp. Form.C38H35N3O7S
Mol. Mass.677.765
SMILESCOc1cc2CC[C@H](NC(=O)c3cccc(c3)C(=O)Nc3cc(ccc3N)-c3cccs3)c3cc(=O)c(OC)ccc3-c2c(OC)c1OC