Reaction Details
TargetHepatocyte growth factor receptor
LigandBDBM50079540
Substrate/Competitorn/a
Meas. Tech.ChEMBL_1471545 (CHEMBL3420280)
IC50 160±n/a nM
Citation Xing, WAi, JJin, SShi, ZPeng, XWang, LJi, YLu, DLiu, YGeng, MHu, Y Enhancing the cellular anti-proliferation activity of pyridazinones as c-met inhibitors using docking analysis. Eur J Med Chem95:302-12 (2015) 
 
Hepatocyte growth factor receptor
Name:Hepatocyte growth factor receptor
Type:Protein
Mol. Mass.:155559.73
Organism:Homo sapiens (Human)
Description:P08581
Residue:1390
BDBM50079540
NameBDBM50079540
Synonyms:CHEMBL3417464
TypeSmall organic molecule
Emp. Form.C25H28F3N5O3
Mol. Mass.503.5167
SMILESCN(C)CCCCOC(=O)Nc1cccc(Cn2nc(Nc3cccc(c3)C(F)(F)F)ccc2=O)c1