Reaction Details
TargetHepatocyte growth factor receptor
LigandBDBM50079552
Substrate/Competitorn/a
Meas. Tech.ChEMBL_1471545 (CHEMBL3420280)
IC50 51±n/a nM
Citation Xing, WAi, JJin, SShi, ZPeng, XWang, LJi, YLu, DLiu, YGeng, MHu, Y Enhancing the cellular anti-proliferation activity of pyridazinones as c-met inhibitors using docking analysis. Eur J Med Chem95:302-12 (2015) 
 
Hepatocyte growth factor receptor
Name:Hepatocyte growth factor receptor
Type:Protein
Mol. Mass.:155559.73
Organism:Homo sapiens (Human)
Description:P08581
Residue:1390
BDBM50079552
NameBDBM50079552
Synonyms:CHEMBL3417476
TypeSmall organic molecule
Emp. Form.C26H28FN5O4
Mol. Mass.493.53
SMILESCN(C)CCOCCOC(=O)Nc1cccc(Cn2nc(ccc2=O)-n2ccc3ccc(F)cc23)c1