Reaction Details
TargetHepatocyte growth factor receptor
LigandBDBM50079561
Substrate/Competitorn/a
Meas. Tech.ChEMBL_1471545 (CHEMBL3420280)
IC50 1.7±n/a nM
Citation Xing, WAi, JJin, SShi, ZPeng, XWang, LJi, YLu, DLiu, YGeng, MHu, Y Enhancing the cellular anti-proliferation activity of pyridazinones as c-met inhibitors using docking analysis. Eur J Med Chem95:302-12 (2015) 
 
Hepatocyte growth factor receptor
Name:Hepatocyte growth factor receptor
Type:Protein
Mol. Mass.:155559.73
Organism:Homo sapiens (Human)
Description:P08581
Residue:1390
BDBM50079561
NameBDBM50079561
Synonyms:CHEMBL3417485
TypeSmall organic molecule
Emp. Form.C30H30FN7O2
Mol. Mass.539.6033
SMILESCN1CCN(CCOc2cnc(nc2)-c2cccc(Cn3nc(ccc3=O)-n3ccc4ccc(F)cc34)c2)CC1