Reaction Details
TargetEphrin type-A receptor 2
LigandBDBM50079565
Substrate/Competitorn/a
Meas. Tech.ChEMBL_1471574 (CHEMBL3420309)
IC50>1000±n/a nM
Citation Xing, WAi, JJin, SShi, ZPeng, XWang, LJi, YLu, DLiu, YGeng, MHu, Y Enhancing the cellular anti-proliferation activity of pyridazinones as c-met inhibitors using docking analysis. Eur J Med Chem95:302-12 (2015) 
 
Ephrin type-A receptor 2
Name:Ephrin type-A receptor 2
Type:PROTEIN
Mol. Mass.:108260.70
Organism:Homo sapiens (Human)
Description:ChEMBL_1505248
Residue:976
BDBM50079565
NameBDBM50079565
Synonyms:CHEMBL3417489
TypeSmall organic molecule
Emp. Form.C30H30FN5O4
Mol. Mass.543.5887
SMILESFc1ccc2ccn(-c3ccc(=O)n(CCOc4ccnc5cc(OCCCN6CCOCC6)ccc45)n3)c2c1