Reaction Details
TargetCytochrome P450 2D6
LigandBDBM50079575
Substrate/Competitorn/a
Meas. Tech.ChEMBL_1471689 (CHEMBL3421057)
IC50>30000±n/a nM
Citation Hudkins, RLBecknell, NCLyons, JAAimone, LDOlsen, MHaltiwanger, RCMathiasen, JRRaddatz, RGruner, JA 3,4-Diaza-bicyclo[4.1.0]hept-4-en-2-one phenoxypropylamine analogs of irdabisant (CEP-26401) as potent histamine-3 receptor inverse agonists with robust wake-promoting activity. Eur J Med Chem95:349-56 (2015) 
 
Cytochrome P450 2D6
Name:Cytochrome P450 2D6
Type:Protein
Mol. Mass.:55774.82
Organism:Homo sapiens (Human)
Description:P10635
Residue:497
BDBM50079575
NameBDBM50079575
Synonyms:CHEMBL3417586
TypeSmall organic molecule
Emp. Form.C19H25N3O2
Mol. Mass.327.4207
SMILES[H][C@]12C[C@@]1([H])C(=NNC2=O)c1ccc(OCCCN2CCC[C@H]2C)cc1