Reaction Details
TargetPotassium voltage-gated channel subfamily H member 2
LigandBDBM50079579
Substrate/Competitorn/a
Meas. Tech.ChEMBL_1471694 (CHEMBL3421062)
IC50 8000±n/a nM
Citation Hudkins, RLBecknell, NCLyons, JAAimone, LDOlsen, MHaltiwanger, RCMathiasen, JRRaddatz, RGruner, JA 3,4-Diaza-bicyclo[4.1.0]hept-4-en-2-one phenoxypropylamine analogs of irdabisant (CEP-26401) as potent histamine-3 receptor inverse agonists with robust wake-promoting activity. Eur J Med Chem95:349-56 (2015) 
 
Potassium voltage-gated channel subfamily H member 2
Name:Potassium voltage-gated channel subfamily H member 2
Type:Multi-pass membrane protein
Mol. Mass.:126672.65
Organism:Homo sapiens (Human)
Description:Q12809
Residue:1159
BDBM50079579
NameBDBM50079579
Synonyms:CHEMBL3417505
TypeSmall organic molecule
Emp. Form.C20H27N3O2
Mol. Mass.341.4473
SMILESC[C@H](COc1ccc(cc1)C1=NNC(=O)C2CC12)CN1CCC[C@H]1C