Reaction Details
TargetProtein mono-ADP-ribosyltransferase PARP10
LigandBDBM50079626
Substrate/Competitorn/a
Meas. Tech.ChEMBL_1472392 (CHEMBL3420113)
IC50 2400±n/a nM
Citation Ekblad, TLindgren, AEAndersson, CDCaraballo, RThorsell, AGKarlberg, TSpjut, SLinusson, ASchüler, HElofsson, M Towards small molecule inhibitors of mono-ADP-ribosyltransferases. Eur J Med Chem95:546-51 (2015) 
 
Protein mono-ADP-ribosyltransferase PARP10
Name:Protein mono-ADP-ribosyltransferase PARP10
Type:n/a
Mol. Mass.:109953.63
Organism:Homo sapiens (Human)
Description:Q53GL7
Residue:1025
BDBM50079626
NameBDBM50079626
Synonyms:CHEMBL3414769
TypeSmall organic molecule
Emp. Form.C13H12N2O3
Mol. Mass.244.246
SMILESCC1=C(C)C(=O)N(C1=O)c1cccc(c1)C(N)=O