Reaction Details
TargetProtein mono-ADP-ribosyltransferase PARP14
LigandBDBM50079625
Substrate/Competitorn/a
Meas. Tech.ChEMBL_1472393 (CHEMBL3420114)
IC50>20000±n/a nM
Citation Ekblad, TLindgren, AEAndersson, CDCaraballo, RThorsell, AGKarlberg, TSpjut, SLinusson, ASchüler, HElofsson, M Towards small molecule inhibitors of mono-ADP-ribosyltransferases. Eur J Med Chem95:546-51 (2015) 
 
Protein mono-ADP-ribosyltransferase PARP14
Name:Protein mono-ADP-ribosyltransferase PARP14
Type:n/a
Mol. Mass.:202812.41
Organism:Homo sapiens (Human)
Description:Q460N5
Residue:1801
BDBM50079625
NameBDBM50079625
Synonyms:CHEMBL3414770
TypeSmall organic molecule
Emp. Form.C12H14N2O4
Mol. Mass.250.2506
SMILESNC(=O)c1cccc(NC(=O)CCCC(O)=O)c1